{"text_format":"1","workbook":"xlsx","n_sheets":15,"sheets":["Front Page","Disclaimer","Methodology","Significance Description","Summary","Option A","Option B","Option C","Option D","Option E","Site_2","Site_3","Site_4","Site_1","Sheet1"],"not_rendered":{"charts":0,"images":2,"macros":1,"external_links":0,"defined_names":15,"comments":2,"pivot_tables":0},"unopened":[],"bounds":{"document_bytes":16777216,"sheet_cells":100000,"rows_first":2000,"rows_last":500,"rows_between":2000,"halvings":0,"cell_chars":16384,"cell_head_chars":4096},"cells_cut":0,"cells_raw":0,"read":"whole","date_system":"1900"}

{"sheet":"Front Page","index":0,"n_rows":30,"n_cols":11,"rows_kept":30,"cut":false,"hidden":false,"merged":[[7,2,8,10]]}
[]
[]
[]
[]
[]
[]
[]
[]
{"$rows_left_out":23}
{"sheet":"Disclaimer","index":1,"n_rows":41,"n_cols":7,"rows_kept":41,"cut":false,"hidden":false,"merged":[[39,1,39,2],[39,6,39,7],[40,1,40,2],[40,6,40,7],[41,1,41,2],[41,6,41,7],[8,4,8,6],[21,2,34,6],[37,1,37,2],[37,6,37,7],[38,1,38,2],[38,6,38,7]]}
[]
[]
[]
[]
[null,null,null,"Contract  No:","C0428"]
[]
[null,null,null,"Issue",3]
[]
{"$rows_left_out":34}
{"sheet":"Methodology","index":2,"n_rows":19,"n_cols":11,"rows_kept":19,"cut":false,"hidden":false,"merged":[[2,1,2,3],[3,1,3,3],[7,0,7,1],[7,2,7,10],[16,0,16,10],[9,3,9,7],[17,0,17,10],[18,0,18,10],[11,0,11,10],[12,0,12,10],[13,0,13,10],[14,0,14,10],[15,0,15,10]]}
["The methodology used for the assessment of all options is outlined below, with an explanation given under each header. The same assessment matrices has been used for the assessment of all sites, hence all follow the same format. "]
[]
["Spatial Option"]
["Option Summary"]
["Option Description"]
["Assumptions Made"]
[]
["SA Framework",null,"SA Policy Assessment"]
{"$rows_left_out":12}
{"sheet":"Significance Description","index":3,"n_rows":28,"n_cols":10,"rows_kept":28,"cut":false,"hidden":false,"merged":[[2,1,2,2],[2,7,2,9],[4,7,11,7],[4,8,11,8],[4,9,11,9],[7,1,10,1],[11,1,14,1],[12,7,18,7],[12,8,18,8],[12,9,18,9],[15,1,18,1],[21,7,26,7],[21,8,26,8],[21,9,26,9],[27,7,36,7],[27,8,36,8],[27,9,36,9]]}
[]
[]
[null,"Nature of effects",null,null,null,null,null,"Significance Scores"]
[null,"Criterion","Description",null,null,null,null,"Symbol","Definitions of Significance of Effects Against the SA Objectives","Assumptions on the nature of effects"]
[null,"Significance ","An assessment of the significance of the potential effects identified. This could be a positive effect, negative effect, neutral effect, significant positive effect or significant negative effect. The definitions for these effects are detailed to the right.",null,null,null,null,"++","Significant Positive Effect: the policy option supports the achievement of this objective; it addresses all relevant assessment questions and could result in a potentially significant beneficial effect e.g. improved access by walking and cycling modes to a local or town centre","Permanent\nContinual\nMagnitude: High 80%+ receptor or environmental capacity affected; or Medium 40-80% of receptor or environmental capacity of affected\nThe effect could be to:\n•\tenhance and redefine the location in a positive manner, making a contribution at a national or international scale; \n•\trepair or restore receptors badly damaged or degraded through previous uses; and/or \n•\timprove one or more key elements/features/ characteristics of a receptor with recognised quality such as a specific regional or national designation."]
[null,"Permanent/temporary","An assessment of whether the predicted effects would be permanent (P), or temporary (T). "]
[null,"Reversible/Irreversible","An assessment of whether or not the identified effect can be reversed (R) e.g. the loss of greenfield land to development would be irreversible (I). "]
[null,"Spatial extent","How far the effect is predicted to be spread geographically: "]
{"$rows_left_out":21}
{"sheet":"Summary","index":4,"n_rows":8,"n_cols":22,"rows_kept":8,"cut":false,"hidden":false,"merged":[]}
[]
[null,null,null,null,null,null,null,null,null,null,null,null,null,null,null,null,null,null,null,null,"Significant Positive","+ +"]
[null,"Site Name","S01","S02","S03","S04","S05","S06","S07","S08","S09","S010","S011","S012","S013","S014","S015","S016",null,null,"Minor Positive","+"]
[null,"Option A",{"$f":"IFERROR(VLOOKUP('Option A'!$I$8, Summary!$U:$V, 2, FALSE), \"\")","v":"-"},{"$f":"IFERROR(VLOOKUP('Option A'!$I$9, Summary!$U:$V, 2, FALSE), \"\")","v":"+ +"},{"$f":"IFERROR(VLOOKUP('Option A'!$I$10, Summary!$U:$V, 2, FALSE), \"\")","v":"+"},{"$f":"IFERROR(VLOOKUP('Option A'!$I$11, Summary!$U:$V, 2, FALSE), \"\")","v":"+"},{"$f":"IFERROR(VLOOKUP('Option A'!$I$12, Summary!$U:$V, 2, FALSE), \"\")","v":"+"},{"$f":"IFERROR(VLOOKUP('Option A'!$I$13, Summary!$U:$V, 2, FALSE), \"\")","v":"+"},{"$f":"IFERROR(VLOOKUP('Option A'!$I$14, Summary!$U:$V, 2, FALSE), \"\")","v":"+ +"},{"$f":"IFERROR(VLOOKUP('Option A'!$I$15, Summary!$U:$V, 2, FALSE), \"\")","v":"+ +"},{"$f":"IFERROR(VLOOKUP('Option A'!$I$16, Summary!$U:$V, 2, FALSE), \"\")","v":"+"},{"$f":"IFERROR(VLOOKUP('Option A'!$I$17, Summary!$U:$V, 2, FALSE), \"\")","v":"-"},{"$f":"IFERROR(VLOOKUP('Option A'!$I$18, Summary!$U:$V, 2, FALSE), \"\")","v":"- -"},{"$f":"IFERROR(VLOOKUP('Option A'!$I$19, Summary!$U:$V, 2, FALSE), \"\")","v":"-"},{"$f":"IFERROR(VLOOKUP('Option A'!$I$20, Summary!$U:$V, 2, FALSE), \"\")","v":"+"},{"$f":"IFERROR(VLOOKUP('Option A'!$I$21, Summary!$U:$V, 2, FALSE), \"\")","v":"- -"},{"$f":"IFERROR(VLOOKUP('Option A'!$I$22, Summary!$U:$V, 2, FALSE), \"\")","v":"+"},{"$f":"IFERROR(VLOOKUP('Option A'!$I$23, Summary!$U:$V, 2, FALSE), \"\")","v":"- -"},null,null,"Neutral",0]
[null,"Option B",{"$f":"IFERROR(VLOOKUP('Option B'!$I$8, Summary!$U:$V, 2, FALSE), \"\")","v":"?"},{"$f":"IFERROR(VLOOKUP('Option B'!$I$9, Summary!$U:$V, 2, FALSE), \"\")","v":"+"},{"$f":"IFERROR(VLOOKUP('Option B'!$I$10, Summary!$U:$V, 2, FALSE), \"\")","v":"-"},{"$f":"IFERROR(VLOOKUP('Option B'!$I$11, Summary!$U:$V, 2, FALSE), \"\")","v":"?"},{"$f":"IFERROR(VLOOKUP('Option B'!$I$12, Summary!$U:$V, 2, FALSE), \"\")","v":"+"},{"$f":"IFERROR(VLOOKUP('Option B'!$I$13, Summary!$U:$V, 2, FALSE), \"\")","v":"+"},{"$f":"IFERROR(VLOOKUP('Option B'!$I$14, Summary!$U:$V, 2, FALSE), \"\")","v":0},{"$f":"IFERROR(VLOOKUP('Option B'!$I$15, Summary!$U:$V, 2, FALSE), \"\")","v":"-"},{"$f":"IFERROR(VLOOKUP('Option B'!$I$16, Summary!$U:$V, 2, FALSE), \"\")","v":"-"},{"$f":"IFERROR(VLOOKUP('Option B'!$I$17, Summary!$U:$V, 2, FALSE), \"\")","v":"+"},{"$f":"IFERROR(VLOOKUP('Option B'!$I$18, Summary!$U:$V, 2, FALSE), \"\")","v":"- -"},{"$f":"IFERROR(VLOOKUP('Option B'!$I$19, Summary!$U:$V, 2, FALSE), \"\")","v":"-"},{"$f":"IFERROR(VLOOKUP('Option B'!$I$20, Summary!$U:$V, 2, FALSE), \"\")","v":"-"},{"$f":"IFERROR(VLOOKUP('Option B'!$I$21, Summary!$U:$V, 2, FALSE), \"\")","v":"?"},{"$f":"IFERROR(VLOOKUP('Option B'!$I$22, Summary!$U:$V, 2, FALSE), \"\")","v":"?"},{"$f":"IFERROR(VLOOKUP('Option B'!$I$23, Summary!$U:$V, 2, FALSE), \"\")","v":"?"},null,null,"Minor Negative","-"]
[null,"Option C",{"$f":"IFERROR(VLOOKUP('Option C'!$I$8, Summary!$U:$V, 2, FALSE), \"\")","v":"?"},{"$f":"IFERROR(VLOOKUP('Option C'!$I$9, Summary!$U:$V, 2, FALSE), \"\")","v":"+"},{"$f":"IFERROR(VLOOKUP('Option C'!$I$10, Summary!$U:$V, 2, FALSE), \"\")","v":"-"},{"$f":"IFERROR(VLOOKUP('Option C'!$I$11, Summary!$U:$V, 2, FALSE), \"\")","v":"?"},{"$f":"IFERROR(VLOOKUP('Option C'!$I$12, Summary!$U:$V, 2, FALSE), \"\")","v":"+"},{"$f":"IFERROR(VLOOKUP('Option C'!$I$13, Summary!$U:$V, 2, FALSE), \"\")","v":"+"},{"$f":"IFERROR(VLOOKUP('Option C'!$I$14, Summary!$U:$V, 2, FALSE), \"\")","v":0},{"$f":"IFERROR(VLOOKUP('Option C'!$I$15, Summary!$U:$V, 2, FALSE), \"\")","v":"-"},{"$f":"IFERROR(VLOOKUP('Option C'!$I$16, Summary!$U:$V, 2, FALSE), \"\")","v":0},{"$f":"IFERROR(VLOOKUP('Option C'!$I$17, Summary!$U:$V, 2, FALSE), \"\")","v":"+"},{"$f":"IFERROR(VLOOKUP('Option C'!$I$18, Summary!$U:$V, 2, FALSE), \"\")","v":"- -"},{"$f":"IFERROR(VLOOKUP('Option C'!$I$19, Summary!$U:$V, 2, FALSE), \"\")","v":"-"},{"$f":"IFERROR(VLOOKUP('Option C'!$I$20, Summary!$U:$V, 2, FALSE), \"\")","v":"-"},{"$f":"IFERROR(VLOOKUP('Option C'!$I$21, Summary!$U:$V, 2, FALSE), \"\")","v":"?"},{"$f":"IFERROR(VLOOKUP('Option C'!$I$22, Summary!$U:$V, 2, FALSE), \"\")","v":"?"},{"$f":"IFERROR(VLOOKUP('Option C'!$I$23, Summary!$U:$V, 2, FALSE), \"\")","v":"?"},null,null,"Significant Negative","- -"]
[null,"Option D",{"$f":"IFERROR(VLOOKUP('Option D'!$I$8, Summary!$U:$V, 2, FALSE), \"\")","v":"?"},{"$f":"IFERROR(VLOOKUP('Option D'!$I$9, Summary!$U:$V, 2, FALSE), \"\")","v":"+"},{"$f":"IFERROR(VLOOKUP('Option D'!$I$10, Summary!$U:$V, 2, FALSE), \"\")","v":"-"},{"$f":"IFERROR(VLOOKUP('Option D'!$I$11, Summary!$U:$V, 2, FALSE), \"\")","v":"?"},{"$f":"IFERROR(VLOOKUP('Option D'!$I$12, Summary!$U:$V, 2, FALSE), \"\")","v":"?"},{"$f":"IFERROR(VLOOKUP('Option D'!$I$13, Summary!$U:$V, 2, FALSE), \"\")","v":"+"},{"$f":"IFERROR(VLOOKUP('Option D'!$I$14, Summary!$U:$V, 2, FALSE), \"\")","v":"-"},{"$f":"IFERROR(VLOOKUP('Option D'!$I$15, Summary!$U:$V, 2, FALSE), \"\")","v":"- -"},{"$f":"IFERROR(VLOOKUP('Option D'!$I$16, Summary!$U:$V, 2, FALSE), \"\")","v":"- -"},{"$f":"IFERROR(VLOOKUP('Option D'!$I$17, Summary!$U:$V, 2, FALSE), \"\")","v":"+"},{"$f":"IFERROR(VLOOKUP('Option D'!$I$18, Summary!$U:$V, 2, FALSE), \"\")","v":"- -"},{"$f":"IFERROR(VLOOKUP('Option D'!$I$19, Summary!$U:$V, 2, FALSE), \"\")","v":"- -"},{"$f":"IFERROR(VLOOKUP('Option D'!$I$20, Summary!$U:$V, 2, FALSE), \"\")","v":"- -"},{"$f":"IFERROR(VLOOKUP('Option D'!$I$21, Summary!$U:$V, 2, FALSE), \"\")","v":"?"},{"$f":"IFERROR(VLOOKUP('Option D'!$I$22, Summary!$U:$V, 2, FALSE), \"\")","v":"?"},{"$f":"IFERROR(VLOOKUP('Option D'!$I$23, Summary!$U:$V, 2, FALSE), \"\")","v":"- -"},null,null,"Uncertain","?"]
[null,"Option E",{"$f":"IFERROR(VLOOKUP('Option E'!$I$8, Summary!$U:$V, 2, FALSE), \"\")","v":"?"},{"$f":"IFERROR(VLOOKUP('Option E'!$I$9, Summary!$U:$V, 2, FALSE), \"\")","v":"+"},{"$f":"IFERROR(VLOOKUP('Option E'!$I$10, Summary!$U:$V, 2, FALSE), \"\")","v":"+"},{"$f":"IFERROR(VLOOKUP('Option E'!$I$11, Summary!$U:$V, 2, FALSE), \"\")","v":"+"},{"$f":"IFERROR(VLOOKUP('Option E'!$I$12, Summary!$U:$V, 2, FALSE), \"\")","v":"+"},{"$f":"IFERROR(VLOOKUP('Option E'!$I$13, Summary!$U:$V, 2, FALSE), \"\")","v":"+"},{"$f":"IFERROR(VLOOKUP('Option E'!$I$14, Summary!$U:$V, 2, FALSE), \"\")","v":"+"},{"$f":"IFERROR(VLOOKUP('Option E'!$I$15, Summary!$U:$V, 2, FALSE), \"\")","v":"-"},{"$f":"IFERROR(VLOOKUP('Option E'!$I$16, Summary!$U:$V, 2, FALSE), \"\")","v":"-"},{"$f":"IFERROR(VLOOKUP('Option E'!$I$17, Summary!$U:$V, 2, FALSE), \"\")","v":"+"},{"$f":"IFERROR(VLOOKUP('Option E'!$I$18, Summary!$U:$V, 2, FALSE), \"\")","v":"- -"},{"$f":"IFERROR(VLOOKUP('Option E'!$I$19, Summary!$U:$V, 2, FALSE), \"\")","v":"-"},{"$f":"IFERROR(VLOOKUP('Option E'!$I$20, Summary!$U:$V, 2, FALSE), \"\")","v":"-"},{"$f":"IFERROR(VLOOKUP('Option E'!$I$21, Summary!$U:$V, 2, FALSE), \"\")","v":"- -"},{"$f":"IFERROR(VLOOKUP('Option E'!$I$22, Summary!$U:$V, 2, FALSE), \"\")","v":"?"},{"$f":"IFERROR(VLOOKUP('Option E'!$I$23, Summary!$U:$V, 2, FALSE), \"\")","v":"?"}]
{"$rows_left_out":1}
{"sheet":"Option A","index":5,"n_rows":23,"n_cols":11,"rows_kept":23,"cut":false,"hidden":false,"merged":[[5,0,5,1],[5,3,5,10]]}
["Spatial Option","Option A"]
["Option Summary"]
["Option Description","100% Derby Fringe and Strategic Allocations"]
["Assumptions Made","Strategic allocations include STRA1, STRA2 and FLG1 Brun Lane"]
[]
["SA Framework",null,"GIS Inputs","SA Policy Assessment"]
["SA objective","SA sub-objective","Spatially assessable? ","Direct/\nIndirect","Magnitude","Duration","Spatial Extent","Permanence/ Reversibility","Significance","Description of potential effects","Potential for cumulative effects? "]
["S01 Biodiversity\nTo safeguard and enhance biodiversity (including BAP habitats and species) and geodiversity through biodiversity net gain and improve connectivity between, and access to, green spaces and functional habitats.","· Will it conserve and enhance natural or semi natural habitats including internationally, nationally and locally designated wildlife sites, or create new wildlife habitats, and contribute to the creation of a network of habitats and green infrastructure in the District?\n· Will it protect BAP or protected species and contribute to the delivery of new, or safeguard existing BAP priority species and habitats?\n· Will it protect sites of geological importance?","Yes","Direct","Low","Medium(10yrs)","Localised","Permanent/Irreversible","Minor Negative","Development in the Derby Fringe area is anticipated to improve biodiversity, with the potential to enhance biodiversity. However, development may result in low level loss of habitats at sites around the Derby Fringe. STRA1 contains a local wildlife site, a LIG, and contains a number of TPOs, whilst STRA2 has no internationally designated/BAP species or habitats located on or near to this site, nor are there any locally designated wildlife sites nearby. Habitat loss is therefore not considered to be significant. ","Yes"]
{"$rows_left_out":16}
{"sheet":"Option B","index":6,"n_rows":23,"n_cols":11,"rows_kept":23,"cut":false,"hidden":false,"merged":[[5,0,5,1],[5,3,5,10]]}
["Spatial Option","Option B"]
["Option Summary"]
["Option Description","0% Derby Fringe, 100% Swadlincote and Key Service Villages (equal split between all)"]
["Assumptions Made"]
[]
["SA Framework",null,"GIS Inputs","SA Policy Assessment"]
["SA objective","SA sub-objective","Spatially assessable? ","Direct/\nIndirect","Magnitude","Duration","Spatial Extent","Permanence/ Reversibility","Significance","Description of potential effects","Potential for cumulative effects? "]
["S01 Biodiversity\nTo safeguard and enhance biodiversity (including BAP habitats and species) and geodiversity through biodiversity net gain and improve connectivity between, and access to, green spaces and functional habitats.","· Will it conserve and enhance natural or semi natural habitats including internationally, nationally and locally designated wildlife sites, or create new wildlife habitats, and contribute to the creation of a network of habitats and green infrastructure in the District?\n· Will it protect BAP or protected species and contribute to the delivery of new, or safeguard existing BAP priority species and habitats?\n· Will it protect sites of geological importance?","Yes","N/A","N/A","N/A","N/A","N/A","Uncertain","Development in Swadlincote and key service villages has potential to result in  loss of biodiversity, particularly given the quantities of greenfield land in these areas. However, this will depend on the exact location of development that may occur.","Yes"]
{"$rows_left_out":16}
{"sheet":"Option C","index":7,"n_rows":23,"n_cols":11,"rows_kept":23,"cut":false,"hidden":false,"merged":[[5,0,5,1],[5,3,5,10]]}
["Spatial Option","Option C"]
["Option Summary"]
["Option Description","0% Derby Fringe, 50% Swadlincote and 50% Key Service Villages"]
["Assumptions Made"]
[]
["SA Framework",null,"GIS Inputs","SA Policy Assessment"]
["SA objective","SA sub-objective","Spatially assessable? ","Direct/\nIndirect","Magnitude","Duration","Spatial Extent","Permanence/ Reversibility","Significance","Description of potential effects","Potential for cumulative effects? "]
["S01 Biodiversity\nTo safeguard and enhance biodiversity (including BAP habitats and species) and geodiversity through biodiversity net gain and improve connectivity between, and access to, green spaces and functional habitats.","· Will it conserve and enhance natural or semi natural habitats including internationally, nationally and locally designated wildlife sites, or create new wildlife habitats, and contribute to the creation of a network of habitats and green infrastructure in the District?\n· Will it protect BAP or protected species and contribute to the delivery of new, or safeguard existing BAP priority species and habitats?\n· Will it protect sites of geological importance?","Yes","N/A","N/A","N/A","N/A","N/A","Uncertain","Development in Swadlincote and key service villages has potential to result in  loss of biodiversity, particularly given the quantities of greenfield land in these areas. However, this is likely to depend on the location of development that may occur.","Yes"]
{"$rows_left_out":16}
{"sheet":"Option D","index":8,"n_rows":23,"n_cols":11,"rows_kept":23,"cut":false,"hidden":false,"merged":[[5,0,5,1],[5,3,5,10]]}
["Spatial Option","Option D"]
["Option Summary"]
["Option Description","0% Derby Fringe, 40% Swadlincote, 40% split between Key Service Villages and 20% other Local Service Villages"]
["Assumptions Made"]
[]
["SA Framework",null,"GIS Inputs","SA Policy Assessment"]
["SA objective","SA sub-objective","Spatially assessable? ","Direct/\nIndirect","Magnitude","Duration","Spatial Extent","Permanence/ Reversibility","Significance","Description of potential effects","Potential for cumulative effects? "]
["S01 Biodiversity\nTo safeguard and enhance biodiversity (including BAP habitats and species) and geodiversity through biodiversity net gain and improve connectivity between, and access to, green spaces and functional habitats.","· Will it conserve and enhance natural or semi natural habitats including internationally, nationally and locally designated wildlife sites, or create new wildlife habitats, and contribute to the creation of a network of habitats and green infrastructure in the District?\n· Will it protect BAP or protected species and contribute to the delivery of new, or safeguard existing BAP priority species and habitats?\n· Will it protect sites of geological importance?","Yes","Direct","Low","Medium(10yrs)","Localised","Permeant/Irreversible","Uncertain","Development as part of this option could be much wider spread compared to the other options and large quantities of greenfield land may  be developed in and around local service villages. However, effects will be dependent upon the sites that come forward. ","Yes"]
{"$rows_left_out":16}
{"sheet":"Option E","index":9,"n_rows":23,"n_cols":11,"rows_kept":23,"cut":false,"hidden":false,"merged":[[5,0,5,1],[5,3,5,10]]}
["Spatial Option","Option E"]
["Option Summary"]
["Option Description","50% Derby Fringe, 50% equal dispersion Swadlincote and Key Service Villages"]
["Assumptions Made"]
[]
["SA Framework",null,"GIS Inputs","SA Policy Assessment"]
["SA objective","SA sub-objective","Spatially assessable? ","Direct/\nIndirect","Magnitude","Duration","Spatial Extent","Permanence/ Reversibility","Significance","Description of potential effects","Potential for cumulative effects? "]
["S01 Biodiversity\nTo safeguard and enhance biodiversity (including BAP habitats and species) and geodiversity through biodiversity net gain and improve connectivity between, and access to, green spaces and functional habitats.","· Will it conserve and enhance natural or semi natural habitats including internationally, nationally and locally designated wildlife sites, or create new wildlife habitats, and contribute to the creation of a network of habitats and green infrastructure in the District?\n· Will it protect BAP or protected species and contribute to the delivery of new, or safeguard existing BAP priority species and habitats?\n· Will it protect sites of geological importance?","Yes","N/A","N/A","N/A","N/A","N/A","Uncertain","Development in the Derby Fringe, Swadlincote and key service villages has potential to result in  loss of biodiversity, particularly given the quantities of greenfield land in these areas. However, this will depend on the exact location of development that may occur.","Yes"]
{"$rows_left_out":16}
{"sheet":"Site_2","index":10,"n_rows":27,"n_cols":22,"rows_kept":27,"cut":false,"hidden":true,"merged":[[9,0,9,2],[9,3,9,6],[9,7,9,17]]}
["Site Name",null,"Site_2"]
["Site Address",null,"Thulston Fields"]
["Town/Locality",null,"Elvaston"]
["Est Housing Yield/Employment Space",null,"1750 dwellings"]
["Site Area (ha)",null,108]
["Site Description",null,"The site suggests the provision of:\n- A new local centre\n- A new primary school (including playing fields)\n- Open space\n- New recreation facilities (including sports pitches, play space, community orchard)\n"]
["Greenfield/Brownfield",null,"Greenfield"]
["Assumptions Made",null,"This allocation will work alongside the policies set out in the South Derbyshire Local Plan Part 1."]
{"$rows_left_out":20}
{"sheet":"Site_3","index":11,"n_rows":27,"n_cols":22,"rows_kept":27,"cut":false,"hidden":true,"merged":[[9,0,9,2],[9,3,9,6],[9,7,9,17]]}
["Site Name",null,"Site_3"]
["Site Address",null,"Land South of Mickleover"]
["Town/Locality",null,"Burnaston"]
["Est Housing Yield/Employment Space",null,"2500 homes"]
["Site Area (ha)",null,200]
["Site Description",null,"The site suggests the provision of:\n- Provision of Gypsy and Traveller pitches\n- A new local centre (including retail facilities)\n- A primary school\n- A secondary school\n- A sports hub\n- Financial contributions towards a secondary school and healthcare\n"]
["Greenfield/Brownfield",null,"Greenfield"]
["Assumptions Made",null,"This allocation will work alongside the policies set out in the South Derbyshire Local Plan Part 1."]
{"$rows_left_out":20}
{"sheet":"Site_4","index":12,"n_rows":27,"n_cols":22,"rows_kept":27,"cut":false,"hidden":true,"merged":[[9,0,9,2],[9,3,9,6],[9,7,9,17]]}
["Site Name",null,"Site_4"]
["Site Address",null,"South of Littleover"]
["Town/Locality",null,"Twyford & Stenson and Stenson Fields"]
["Est Housing Yield/Employment Space",null,"7,200 dwellings"]
["Site Area (ha)",null,361]
["Site Description",null,"The site suggests the provision of:\n- A new primary school\n- A new train station linked to the South Derby Integrated Transport Link development"]
["Greenfield/Brownfield",null,"Greenfield"]
["Assumptions Made",null,"This allocation will work alongside the policies set out in the South Derbyshire Local Plan Part 1."]
{"$rows_left_out":20}
{"sheet":"Site_1","index":13,"n_rows":27,"n_cols":22,"rows_kept":27,"cut":false,"hidden":true,"merged":[[9,0,9,2],[9,7,9,17],[9,3,9,6]]}
["Site Name",null,"Site_1"]
["Site Address",null,"Infinity Garden Village"]
["Town/Locality",null,"Barrow Upon Trent; Stenson Fields; Twyford and Stenson and Swarkestone"]
["Est Housing Yield/Employment Space",null,"2000 dwellings, 70ha employment land"]
["Site Area (ha)",null,205]
["Site Description",null,"The development of this site will also provide:\n- Provision of Gypsy and Traveller pitches\n- Primary vehicle accesses via a new junction on the A50 and junctions via Infinity Park Way\n- A new local centre (including retail facilities)\n- A two form entry primary school\n- A secondary school (including community sport facilities)\n- Recreation facilities"]
["Greenfield/Brownfield",null,"Greenfield"]
["Assumptions Made",null,"This allocation will work alongside the policies set out in the South Derbyshire Local Plan Part 1."]
{"$rows_left_out":20}
{"sheet":"Sheet1","index":14,"n_rows":86,"n_cols":12,"rows_kept":86,"cut":false,"hidden":true,"merged":[]}
["Area of search code","Settlement heirarchy","Area of search","LA","Site code","Site name","Potential capacity","Notes","Achieveable? ","Available","Suitable","Allocaed? "]
["C1","DUA","SDDC DUA - west","AVBC","AVBC-2021-0009","Land off Brun Lane, Mackworth",2000,"Assessed at 2000, but promoted capacity of 2250","Y","Y","Y","Y"]
["C1","DUA",null,"AVBC","AVBC-2014-0014","Land off Radbourne Lane, Mackworth",600,null,"Y","Y","Y"]
["C1","DUA",null,"SDDC",252,"Land off Staker Lane, Derby",3657,"Noted that yield could change due to BNG requirements","Y","n - land north of Etwall road is not available","y"]
["C1","DUA",null,"SDDC",155,"Land at Bannell's Lane and Etwall Road, Mickleover",247,"Noted that yield could change due to BNG requirements","y","y","y"]
["C1","DUA",null,"SDDC",123,"Land north of Hospital Lane, Mickleover",234,"Noted that yield could change due to BNG requirements","y","y","y"]
["C1","DUA",null,"SDDC",136,"Land south of Mickleover",3066,"promoted as 1500-2000","y","y","y"]
["C1","DUA",null,"SDDC",221,"Land south of Mickleover",2230,"Noted that yield could change due to BNG requirements","y","y","y"]
{"$rows_left_out":78}